$100 Website Offer

Get your personal website + domain for just $100.

Limited Time Offer!

Claim Your Website Now

Problem

I’m using flutter_recaptcha_v2: ^0.1.0. Now, I am trying to run it using flutter run, however, it will not start because of the following error:

Error: Cannot run with sound null safety, because the following dependencies
don't support null safety:

- package:flutter_recaptcha_v2
- package:webview_flutter
- package:http
- package:http_parser

For solutions, see https://dart.dev/go/unsound-null-safety
FAILURE: Build failed with an exception.

* Where:
Script 'C:\src\flutter\packages\flutter_tools\gradle\flutter.gradle' line: 1035

* What went wrong:
Execution failed for task ':app:compileFlutterBuildDebug'.
> Process 'command 'C:\src\flutter\bin\flutter.bat'' finished with non-zero exit value 1

* Try:
Run with --stacktrace option to get the stack trace. Run with --info or --debug option to get more log output. Run with --scan to get full insights.

* Get more help at https://help.gradle.org

BUILD FAILED in 21s
Exception: Gradle task assembleDebug failed with exit code 1
Exited (sigterm)

Solution

If you want run your project with --no-sound-null-safety so now you add this line your main.dart file in top(first line) with comment..

// @dart=2.9

then run your project.

Thanks for reading.

Keep Coding.

5 1 vote
Article Rating
Subscribe
Notify of
guest

1 Comment
Oldest
Newest Most Voted
Kiara
Kiara
24 days ago

It’s also important to verify dependency compatibility during CI builds, since local fixes can still fail when the project is built with a clean environment.

1
0
Would love your thoughts, please comment.x
()
x